{"text_format":"1","workbook":"xlsx","n_sheets":7,"sheets":["Delivery_Fee","country_code","Mail申請","紙申請","個人受付","店舗受付","Send_Mail"],"not_rendered":{"charts":0,"images":50,"macros":1,"external_links":0,"defined_names":6,"comments":1,"pivot_tables":0},"unopened":[],"bounds":{"document_bytes":16777216,"sheet_cells":100000,"rows_first":2000,"rows_last":500,"rows_between":2000,"halvings":0,"cell_chars":16384,"cell_head_chars":4096},"cells_cut":0,"cells_raw":0,"read":"whole","date_system":"1900"}

{"sheet":"Delivery_Fee","index":0,"n_rows":36,"n_cols":21,"rows_kept":36,"cut":false,"hidden":true,"merged":[[0,0,0,20],[3,13,3,16],[3,9,3,12],[3,5,3,8],[3,1,3,4],[2,13,2,16],[2,9,2,12],[2,5,2,8],[2,1,2,4],[2,17,2,20],[3,17,3,20]]}
["国際郵便&国際小包料金表"]
[]
[null,"第1地帯",null,null,null,"第2地帯",null,null,null,"第3地帯",null,null,null,"第4地帯",null,null,null,"第5地帯"]
["重量","東アジア\n韓国/中国/香港/台湾",null,null,null,"アジア（中国・韓国・台湾を除く）\nタイ/シンガポール/インド等",null,null,null,"オセアニア・カナダ・メキシコ・中近東・ヨーロッパ",null,null,null,"米国\n（グアム等海外領土含む）",null,null,null,"中南米（メキシコを除く）・アフリカ\nブラジル/エジプト/ケニア等"]
[1,{"$f":"A5+1","v":2},{"$f":"B5+1","v":3},{"$f":"C5+1","v":4},5,6,7,8,9,10,11,12,13,14,15,16,17,18,19,20,21]
["WEIGHT","EMS","AIR","SAL","SHIP","EMS","AIR","SAL","SHIP","EMS","AIR","SAL","SHIP","EMS","AIR","SAL","SHIP","EMS","AIR","SAL","SHIP"]
[1,2200,2050,1900,1800,3150,2500,2300,2100,4400,3850,2800,2500,5300,4200,2900,2600,5100,4550,3500,2700]
[{"$f":"A7+1","v":2},3400,2750,2500,2200,4550,3700,3000,2600,6700,6000,4000,3100,7900,6700,4100,3300,8100,7250,5400,3400]
[{"$f":"A8+1","v":3},4400,3450,3100,2600,5750,4900,3700,3100,8800,8150,5200,3700,10300,9200,5300,4000,11100,9950,7300,4100]
[4,5400,4150,3700,3000,6950,6100,4400,3600,10900,10300,6400,4300,12700,11700,6500,4700,14100,12650,9200,4800]
[5,6400,4850,4300,3400,8150,7300,5100,4100,13000,12450,7600,4900,15100,14200,7700,5400,17100,15350,11100,5500]
[6,7400,5550,4800,3800,9350,8500,5700,4600,15100,14600,8600,5500,17500,16700,8700,6100,20100,18050,12300,6200]
[7,8200,6250,5300,4200,10350,9700,6300,5100,17200,16750,9600,6100,19900,19200,9700,6800,22500,20750,13500,6900]
[8,9000,6950,5800,4600,11350,10900,6900,5600,19300,18900,10600,6700,22300,21700,10700,7500,24900,23450,14700,7600]
[9,9800,7650,6300,5000,12350,12100,7500,6100,21400,21050,11600,7300,24700,24200,11700,8200,27300,26150,15900,8300]
[10,10600,8350,6800,5400,13350,13300,8100,6600,23500,23200,12600,7900,27100,26700,12700,8900,29700,28850,17100,9000]
[11,11400,8850,7300,5800,14350,13950,8700,7000,25600,24800,13600,8300,29500,28700,13700,9500,32100,30650,18300,9600]
[12,12200,9350,7800,6200,15350,14600,9300,7400,27700,26400,14600,8700,31900,30700,14700,10100,34500,32450,19500,10200]
[13,13000,9850,8300,6600,16350,15250,9900,7800,29800,28000,15600,9100,34300,32700,15700,10700,36900,34250,20700,10800]
[14,13800,10350,8800,7000,17350,15900,10500,8200,31900,29600,16600,9500,36700,34700,16700,11300,39300,36050,21900,11400]
[15,14600,10850,9300,7400,18350,16550,11100,8600,34000,31200,17600,9900,39100,36700,17700,11900,41700,37850,23100,12000]
[16,15400,11350,9800,7800,19350,17200,11700,9000,36100,32800,18600,10300,41500,38700,18700,12500,44100,39650,24300,12600]
[17,16200,11850,10300,8200,20350,17850,12300,9400,38200,34400,19600,10700,43900,40700,19700,13100,46500,41450,25500,13200]
[18,17000,12350,10800,8600,21350,18500,12900,9800,40300,36000,20600,11100,46300,42700,20700,13700,48900,43250,26700,13800]
[19,17800,12850,11300,9000,22350,19150,13500,10200,42400,37600,21600,11500,48700,44700,21700,14300,51300,45050,27900,14400]
[20,18600,13350,11800,9400,23350,19800,14100,10600,44500,39200,22600,11900,51100,46700,22700,14900,53700,46850,29100,15000]
[21,19400,13850,12300,9800,24350,20450,14700,11000,46600,40800,23600,12300,53500,48700,23700,15500,56100,48650,30300,15600]
[22,20200,14350,12800,10200,25350,21100,15300,11400,48700,42400,24600,12700,55900,50700,24700,16100,58500,50450,31500,16200]
[23,21000,14850,13300,10600,26350,21750,15900,11800,50800,44000,25600,13100,58300,52700,25700,16700,60900,52250,32700,16800]
[24,21800,15350,13800,11000,27350,22400,16500,12200,52900,45600,26600,13500,60700,54700,26700,17300,63300,54050,33900,17400]
[25,22600,15850,14300,11400,28350,23050,17100,12600,55000,47200,27600,13900,63100,56700,27700,17900,65700,55850,35100,18000]
[26,23400,16350,14800,11800,29350,23700,17700,13000,57100,48800,28600,14300,65500,58700,28700,18500,68100,57650,36300,18600]
[27,24200,16850,15300,12200,30350,24350,18300,13400,59200,50400,29600,14700,67900,60700,29700,19100,70500,59450,37500,19200]
[28,25000,17350,15800,12600,31350,25000,18900,13800,61300,52000,30600,15100,70300,62700,30700,19700,72900,61250,38700,19800]
[29,25800,17850,16300,13000,32350,25650,19500,14200,63400,53600,31600,15500,72700,64700,31700,20300,75300,63050,39900,20400]
[30,26600,18350,16800,13400,33350,26300,20100,14600,65500,55200,32600,15900,75100,66700,32700,20900,77700,64850,41100,21000]

{"sheet":"country_code","index":1,"n_rows":249,"n_cols":11,"rows_kept":249,"cut":false,"hidden":true,"merged":[]}
["No.","国コード","日本名","英名","新地帯","EMS","AIR","SAL","SHIP","EMS/地帯","AIR/地帯"]
[223,"US","アメリカ合衆国","USA","第4地帯",{"$f":"Delivery_Fee!$N$5","v":14},{"$f":"Delivery_Fee!$O$5","v":15},{"$f":"Delivery_Fee!$P$5","v":16},{"$f":"Delivery_Fee!$Q$5","v":17},"第2-1地帯","第3地帯"]
[42,"CN","中国","CHINA","第1地帯",{"$f":"Delivery_Fee!$B$5","v":2},{"$f":"Delivery_Fee!$C$5","v":3},{"$f":"Delivery_Fee!$D$5","v":4},{"$f":"Delivery_Fee!$E$5","v":5},"第1地帯","第1地帯"]
[96,"HK","香港","HONG KONG","第1地帯",{"$f":"Delivery_Fee!$B$5","v":2},{"$f":"Delivery_Fee!$C$5","v":3},{"$f":"Delivery_Fee!$D$5","v":4},{"$f":"Delivery_Fee!$E$5","v":5},"第1地帯","第1地帯"]
[206,"TW","台湾","TAIWAN","第1地帯",{"$f":"Delivery_Fee!$B$5","v":2},{"$f":"Delivery_Fee!$C$5","v":3},{"$f":"Delivery_Fee!$D$5","v":4},{"$f":"Delivery_Fee!$E$5","v":5},"第1地帯","第1地帯"]
[111,"KR","韓国","KOREA","第1地帯",{"$f":"Delivery_Fee!$B$5","v":2},{"$f":"Delivery_Fee!$C$5","v":3},{"$f":"Delivery_Fee!$D$5","v":4},{"$f":"Delivery_Fee!$E$5","v":5},"第1地帯","第1地帯"]
[1,"AF","アフガニスタン","AFGHANISTAN","第2地帯",{"$f":"Delivery_Fee!$F$5","v":6},{"$f":"Delivery_Fee!$G$5","v":7},{"$f":"Delivery_Fee!$H$5","v":8},{"$f":"Delivery_Fee!$I$5","v":9},null,"第2地帯"]
[2,"AL","アルバニア","ALBANIA","第3地帯",{"$f":"Delivery_Fee!$J$5","v":10},{"$f":"Delivery_Fee!$K$5","v":11},{"$f":"Delivery_Fee!$L$5","v":12},{"$f":"Delivery_Fee!$M$5","v":13},null,"第3地帯"]
[3,"DZ","アルジェリア","SHISA","第5地帯",{"$f":"Delivery_Fee!$R$5","v":18},{"$f":"Delivery_Fee!$S$5","v":19},{"$f":"Delivery_Fee!$T$5","v":20},{"$f":"Delivery_Fee!$U$5","v":21},"第3地帯","第4地帯"]
[4,"AO","アンゴラ","ANGOLA","第5地帯",{"$f":"Delivery_Fee!$R$5","v":18},{"$f":"Delivery_Fee!$S$5","v":19},{"$f":"Delivery_Fee!$T$5","v":20},{"$f":"Delivery_Fee!$U$5","v":21},null,"第4地帯"]
[5,"AI","アンギラ","ANGUILLA","第5地帯",{"$f":"Delivery_Fee!$R$5","v":18},{"$f":"Delivery_Fee!$S$5","v":19},{"$f":"Delivery_Fee!$T$5","v":20},{"$f":"Delivery_Fee!$U$5","v":21},null,"第3地帯"]
[6,"AG","アンティグア・バーブーダ","ANTIGUA AND BARBUDA","第5地帯",{"$f":"Delivery_Fee!$R$5","v":18},{"$f":"Delivery_Fee!$S$5","v":19},{"$f":"Delivery_Fee!$T$5","v":20},{"$f":"Delivery_Fee!$U$5","v":21},null,"第3地帯"]
[7,"AR","アルゼンチン","ARGENTINA","第5地帯",{"$f":"Delivery_Fee!$R$5","v":18},{"$f":"Delivery_Fee!$S$5","v":19},{"$f":"Delivery_Fee!$T$5","v":20},{"$f":"Delivery_Fee!$U$5","v":21},"第3地帯","第4地帯"]
[8,"AM","アルメニア","ARMENIA","第3地帯",{"$f":"Delivery_Fee!$J$5","v":10},{"$f":"Delivery_Fee!$K$5","v":11},{"$f":"Delivery_Fee!$L$5","v":12},{"$f":"Delivery_Fee!$M$5","v":13},null,"第3地帯"]
[9,"AW","アルバ","ARUBA","第5地帯",{"$f":"Delivery_Fee!$R$5","v":18},{"$f":"Delivery_Fee!$S$5","v":19},{"$f":"Delivery_Fee!$T$5","v":20},{"$f":"Delivery_Fee!$U$5","v":21},null,"第3地帯"]
[10,"AX","アセンション","ASCENSION","第5地帯",{"$f":"Delivery_Fee!$R$5","v":18},{"$f":"Delivery_Fee!$S$5","v":19},{"$f":"Delivery_Fee!$T$5","v":20},{"$f":"Delivery_Fee!$U$5","v":21},null,"第4地帯"]
[11,"AU","オーストラリア","AUSTRALIA","第3地帯",{"$f":"Delivery_Fee!$J$5","v":10},{"$f":"Delivery_Fee!$K$5","v":11},{"$f":"Delivery_Fee!$L$5","v":12},{"$f":"Delivery_Fee!$M$5","v":13},"第2-1地帯","第3地帯"]
[12,"AT","オーストリア","AUSTRIA","第3地帯",{"$f":"Delivery_Fee!$J$5","v":10},{"$f":"Delivery_Fee!$K$5","v":11},{"$f":"Delivery_Fee!$L$5","v":12},{"$f":"Delivery_Fee!$M$5","v":13},"第2-2地帯","第3地帯"]
[13,"AZ","アゼルバイジャン","AZERBAIJAN","第3地帯",{"$f":"Delivery_Fee!$J$5","v":10},{"$f":"Delivery_Fee!$K$5","v":11},{"$f":"Delivery_Fee!$L$5","v":12},{"$f":"Delivery_Fee!$M$5","v":13},"第2-2地帯","第3地帯"]
[14,"BS","バハマ","BAHAMAS"]
[15,"BH","バーレーン","BAHRAIN","第3地帯",{"$f":"Delivery_Fee!$J$5","v":10},{"$f":"Delivery_Fee!$K$5","v":11},{"$f":"Delivery_Fee!$L$5","v":12},{"$f":"Delivery_Fee!$M$5","v":13},"第2-1地帯","第3地帯"]
[16,"BD","バングラデシュ","BANGLADESH","第2地帯",{"$f":"Delivery_Fee!$F$5","v":6},{"$f":"Delivery_Fee!$G$5","v":7},{"$f":"Delivery_Fee!$H$5","v":8},{"$f":"Delivery_Fee!$I$5","v":9},"第1地帯","第2地帯"]
[17,"BB","バルバドス","BARBADOS","第5地帯",{"$f":"Delivery_Fee!$R$5","v":18},{"$f":"Delivery_Fee!$S$5","v":19},{"$f":"Delivery_Fee!$T$5","v":20},{"$f":"Delivery_Fee!$U$5","v":21},"第2-1地帯","第3地帯"]
[18,"BY","ベラルーシ","BELARUS","第3地帯",{"$f":"Delivery_Fee!$J$5","v":10},{"$f":"Delivery_Fee!$K$5","v":11},{"$f":"Delivery_Fee!$L$5","v":12},{"$f":"Delivery_Fee!$M$5","v":13},"第2-2地帯","第3地帯"]
[19,"BE","ベルギー","BELGIUM","第3地帯",{"$f":"Delivery_Fee!$J$5","v":10},{"$f":"Delivery_Fee!$K$5","v":11},{"$f":"Delivery_Fee!$L$5","v":12},{"$f":"Delivery_Fee!$M$5","v":13},"第2-2地帯","第3地帯"]
[20,"BZ","ベリーズ","BELIZE","第5地帯",{"$f":"Delivery_Fee!$R$5","v":18},{"$f":"Delivery_Fee!$S$5","v":19},{"$f":"Delivery_Fee!$T$5","v":20},{"$f":"Delivery_Fee!$U$5","v":21},null,"第3地帯"]
[21,"BJ","ベナン","BENIN","第5地帯",{"$f":"Delivery_Fee!$R$5","v":18},{"$f":"Delivery_Fee!$S$5","v":19},{"$f":"Delivery_Fee!$T$5","v":20},{"$f":"Delivery_Fee!$U$5","v":21},null,"第4地帯"]
[22,"BM","バーミュダ諸島","BERMUDA","第5地帯",{"$f":"Delivery_Fee!$R$5","v":18},{"$f":"Delivery_Fee!$S$5","v":19},{"$f":"Delivery_Fee!$T$5","v":20},{"$f":"Delivery_Fee!$U$5","v":21},null,"第3地帯"]
[23,"BT","ブータン","BHUTAN","第2地帯",{"$f":"Delivery_Fee!$F$5","v":6},{"$f":"Delivery_Fee!$G$5","v":7},{"$f":"Delivery_Fee!$H$5","v":8},{"$f":"Delivery_Fee!$I$5","v":9},"第1地帯","第2地帯"]
[24,"BO","ボリビア","BOLIVIA","第5地帯",{"$f":"Delivery_Fee!$R$5","v":18},{"$f":"Delivery_Fee!$S$5","v":19},{"$f":"Delivery_Fee!$T$5","v":20},{"$f":"Delivery_Fee!$U$5","v":21},null,"第4地帯"]
[25,"BQ","オランダカリブ領域","BONAIRE SABA AND SINT EUSTATIUS","第5地帯",{"$f":"Delivery_Fee!$R$5","v":18},{"$f":"Delivery_Fee!$S$5","v":19},{"$f":"Delivery_Fee!$T$5","v":20},{"$f":"Delivery_Fee!$U$5","v":21},null,"第3地帯"]
[26,"BA","ボスニア・ヘルツェゴビナ","BOSNIA AND HERZEGOVINA","第3地帯",{"$f":"Delivery_Fee!$J$5","v":10},{"$f":"Delivery_Fee!$K$5","v":11},{"$f":"Delivery_Fee!$L$5","v":12},{"$f":"Delivery_Fee!$M$5","v":13},null,"第3地帯"]
[27,"BW","ボツワナ","BOTSWANA","第5地帯",{"$f":"Delivery_Fee!$R$5","v":18},{"$f":"Delivery_Fee!$S$5","v":19},{"$f":"Delivery_Fee!$T$5","v":20},{"$f":"Delivery_Fee!$U$5","v":21},"第3地帯","第4地帯"]
[28,"BR","ブラジル","BRAZIL","第5地帯",{"$f":"Delivery_Fee!$R$5","v":18},{"$f":"Delivery_Fee!$S$5","v":19},{"$f":"Delivery_Fee!$T$5","v":20},{"$f":"Delivery_Fee!$U$5","v":21},"第3地帯","第4地帯"]
[29,"VG","英領バージン諸島","BRITISH VIRGIN ISLANDS","第5地帯",{"$f":"Delivery_Fee!$R$5","v":18},{"$f":"Delivery_Fee!$S$5","v":19},{"$f":"Delivery_Fee!$T$5","v":20},{"$f":"Delivery_Fee!$U$5","v":21},null,"第3地帯"]
[30,"BN","ブルネイ","BRUNEI","第2地帯",{"$f":"Delivery_Fee!$F$5","v":6},{"$f":"Delivery_Fee!$G$5","v":7},{"$f":"Delivery_Fee!$H$5","v":8},{"$f":"Delivery_Fee!$I$5","v":9},"第1地帯","第2地帯"]
[31,"BG","ブルガリア","BULGARIA","第3地帯",{"$f":"Delivery_Fee!$J$5","v":10},{"$f":"Delivery_Fee!$K$5","v":11},{"$f":"Delivery_Fee!$L$5","v":12},{"$f":"Delivery_Fee!$M$5","v":13},"第2-2地帯","第3地帯"]
[32,"BF","ブルキナファソ","BURKINA FASO","第5地帯",{"$f":"Delivery_Fee!$R$5","v":18},{"$f":"Delivery_Fee!$S$5","v":19},{"$f":"Delivery_Fee!$T$5","v":20},{"$f":"Delivery_Fee!$U$5","v":21},null,"第4地帯"]
[33,"BI","ブルンジ","BURUNDI","第5地帯",{"$f":"Delivery_Fee!$R$5","v":18},{"$f":"Delivery_Fee!$S$5","v":19},{"$f":"Delivery_Fee!$T$5","v":20},{"$f":"Delivery_Fee!$U$5","v":21},null,"第4地帯"]
[34,"KH","カンボジア","CAMBODIA","第2地帯",{"$f":"Delivery_Fee!$F$5","v":6},{"$f":"Delivery_Fee!$G$5","v":7},{"$f":"Delivery_Fee!$H$5","v":8},{"$f":"Delivery_Fee!$I$5","v":9},"第1地帯","第2地帯"]
{"$rows_left_out":210}
{"sheet":"Mail申請","index":2,"n_rows":87,"n_cols":18,"rows_kept":87,"cut":false,"hidden":false,"merged":[[9,15,10,16],[9,1,9,4],[21,0,21,2],[21,3,21,5],[21,6,21,8],[19,1,19,4],[20,1,20,4],[19,5,20,5],[17,5,18,5],[15,5,16,5],[17,6,18,8],[15,6,16,6],[15,7,16,7],[15,8,16,8],[17,1,17,2],[14,1,14,4],[15,1,15,4],[16,1,16,4],[13,1,13,2],[13,5,14,5],[18,1,18,4],[19,7,20,7],[11,6,12,8],[19,8,20,8],[0,0,0,8],[1,0,1,4],[1,5,1,8],[2,1,2,4],[2,5,2,8],[3,1,3,4],[3,5,3,8],[11,1,11,4],[12,1,12,4],[7,1,7,4],[7,5,7,8],[4,3,4,4],[4,5,4,8],[5,2,5,3],[5,5,5,6],[5,7,5,8],[6,1,6,4],[6,5,6,6],[10,0,10,4],[10,5,10,8],[6,7,6,8],[8,1,8,4],[8,5,9,8],[11,5,12,5],[23,0,23,2],[23,7,23,8],[24,0,24,2],[24,7,24,8],[25,0,25,2],[25,7,25,8],[22,0,22,2],[22,3,22,5],[22,6,22,8],[26,0,26,2],[26,7,26,8],[33,0,33,2],[33,7,33,8],[34,0,34,2],[34,7,34,8],[29,0,29,2],[29,7,29,8],[30,0,30,2],[30,7,30,8],[31,0,31,2],[31,7,31,8],[28,0,28,2],[28,7,28,8],[35,0,35,2],[35,7,35,8],[36,0,36,2],[36,7,36,8],[37,0,37,2],[37,7,37,8],[32,0,32,2],[32,7,32,8],[27,0,27,2],[27,7,27,8],[41,0,41,2],[41,7,41,8],[42,0,42,2],[42,7,42,8],[43,0,43,2],[43,7,43,8],[38,0,38,2],[38,7,38,8],[39,0,39,2],[39,7,39,8],[40,0,40,2],[40,7,40,8],[47,0,47,2],[47,7,47,8],[48,0,48,2],[48,7,48,8],[49,0,49,2],[49,7,49,8],[44,0,44,2],[44,7,44,8],[45,0,45,2],[45,7,45,8],[46,0,46,2],[46,7,46,8],[53,0,53,2],[53,7,53,8],[54,0,54,2],[54,7,54,8],[55,0,55,2],[55,7,55,8],[50,0,50,2],[50,7,50,8],[51,0,51,2],[51,7,51,8],[52,0,52,2],[52,7,52,8],[59,0,59,2],[59,7,59,8],[60,0,60,2],[60,7,60,8],[61,0,61,2],[56,0,56,2],[56,7,56,8],[57,0,57,2],[57,7,57,8],[58,0,58,2],[58,7,58,8],[77,0,77,2],[77,7,77,8],[78,0,78,2],[78,7,78,8],[79,0,79,2],[79,7,79,8],[74,0,74,2],[74,7,74,8],[75,0,75,2],[75,7,75,8],[76,0,76,2],[76,7,76,8],[36,12,37,14],[38,12,39,14],[24,12,25,14],[24,15,25,17],[26,12,27,14],[26,15,27,17],[28,10,29,11],[30,10,31,11],[28,15,29,17],[30,15,31,17],[32,15,33,17],[24,10,25,11],[26,10,27,11],[32,10,33,11],[28,12,29,14],[30,12,31,14],[32,12,33,14],[38,10,39,11],[34,10,35,11],[36,10,37,11],[84,0,85,1],[84,2,85,4],[86,0,87,1],[86,2,87,4],[66,10,67,11],[68,10,69,11],[70,10,71,11],[84,5,87,5],[84,6,87,8],[71,7,71,8],[72,0,72,2],[72,7,72,8],[83,0,83,2],[83,7,83,8],[80,0,80,2],[80,7,80,8],[81,0,81,2],[81,7,81,8],[82,0,82,2],[82,7,82,8],[67,0,67,2],[67,7,67,8],[68,7,68,8],[69,0,69,2],[65,0,65,2],[65,7,65,8],[66,7,66,8],[61,7,61,8],[69,7,69,8],[70,0,70,2],[70,7,70,8],[66,0,66,2],[73,0,73,2],[73,7,73,8],[68,0,68,2],[71,0,71,2],[62,0,62,2],[62,7,62,8],[63,0,63,2],[63,7,63,8],[64,0,64,2],[64,7,64,8],[1,10,1,11],[2,10,2,11],[3,10,3,11],[62,10,63,11],[62,12,63,14],[62,15,63,17],[58,10,59,11],[58,12,59,14],[58,15,59,17],[60,10,61,11],[60,12,61,14],[60,15,61,17],[40,10,41,11],[42,10,43,11],[42,12,43,14],[40,12,41,14],[46,10,47,11],[44,12,45,14],[34,15,35,17],[36,15,37,17],[38,15,39,17],[40,15,41,17],[42,15,43,17],[34,12,35,14],[52,10,53,11],[52,12,53,14],[52,15,53,17],[72,12,73,14],[72,15,73,17],[66,12,67,14],[66,15,67,17],[68,12,69,14],[68,15,69,17],[70,12,71,14],[70,15,71,17],[64,12,65,14],[64,15,65,17],[13,6,14,6],[13,7,14,7],[13,8,14,8],[64,10,65,11],[72,10,73,11],[75,10,77,17],[19,6,20,6],[17,15,18,16],[17,17,18,17],[13,15,14,16],[13,17,14,17],[54,10,55,11],[54,12,55,14],[54,15,55,17],[56,10,57,11],[56,12,57,14],[56,15,57,17],[44,15,45,17],[46,12,47,14],[46,15,47,17],[50,10,51,11],[50,12,51,14],[50,15,51,17],[44,10,45,11]]}
["INVOICE"]
["差出人(Sender)",null,null,null,null,"郵便物番号(Mail Item No.)",null,null,null,null,"Mediam Box(mm)",null,600,410,260,null,false]
["Hotel's Name",{"$f":"IF(P53=\"\",\"\",P53)","v":"Okinawa Wonderful Hotel"},null,null,null,{"$f":"TEXT(TODAY(),\"yymmdd\") & \"-\" &P$43","v":"230803-090-2396-5290"},null,null,null,null,"Large Box(mm)",null,600,600,520]
["Room #",{"$f":"IF(P55=\"\",\"\",P55)","v":1006},null,null,null,"差出年月日(Date of Posting)",null,null,null,null,"緩衝材重量",null,2500]
["Postal Code",{"$f":"IF(P57=\"\",\"\",P57)","v":33333},"Bldgs Name",{"$f":"IF(P59=\"\",\"\",P59)","v":44444},null,{"$f":"TODAY()+3","v":"2023-08-06"},null,null,null,null,"追加",{"$f":"COUNTA(A51:C84)","v":0},{"$f":"110*L5","v":0}]
["Address",{"$f":"IF(P61=\"\",\"\",P61)","v":55555},{"$f":"IF(P63=\"\",\"\",P63)","v":"Naha-City"},null,{"$f":"IF(P65=\"\",\"\",P65)","v":"Okinawa"},"ご依頼主指示情報",null,"速やかに返送"]
["Name",{"$f":"IF(P67=\"\",\"\",P67)","v":3},null,null,null,"輸送種別（返送）",null,"最も経済的な線路"]
["TEL",{"$f":"IF(P69=\"\",\"\",P69)","v":"090-2396-5290"},null,null,null,"支払い条件(Terms of Payment)"]
["FAX",{"$f":"IF(P71=\"\",\"\",P71)","v":10},null,null,null,"SAMPLES, NO COMMERCIAL VALUE"]
["email",{"$f":"IF(P73<>\"\",P73&\";\"&\"takara@ryupta.co.jp;taira@ryupta.co.jp\",\"takara@ryupta.co.jp;taira@ryupta.co.jp\")","v":"takara@ryupta.co.jp;taira@ryupta.co.jp"},null,null,null,null,null,null,null,null,null,null,null,null,null,"お客様申請"]
["受取人(Addressee)",null,null,null,null,"備考（Remarks)"]
["Company's Name",{"$f":"IF(P27=\"\",\"\",P27)","v":1},null,null,null,"施設支払額",{"$f":"IF(P10=\"施設申請\",SUM(G16,I14,I16,G14,G18),SUM(G16,I14,I16,G14))","v":6050}]
["Dept Name",{"$f":"IF(P29=\"\",\"\",P29)","v":2}]
["Name",{"$f":"IF(P31=\"\",\"\",P31)","v":3},null,"Postal Code",{"$f":"IF(P33=\"\",\"\",P33)","v":4},"送料",{"$f":"_xlfn.IFS($A$23=\"EMS\",VLOOKUP($I$20,Delivery_Fee!$A$6:$U$35,VLOOKUP($D$23,country_code!$D$2:$I$249,3,0),0),$A$23=\"AIR\",VLOOKUP($I$20,Delivery_Fee!$A$6:$U$35,VLOOKUP($D$23,country_code!$D$2:$I$249,4,0),0),$A$23=\"SAL\",VLOOKUP($I$20,Delivery_Fee!$A$6:$U$35,VLOOKUP($D$23,country_code!$D$2:$I$249,5,0),0),$A$23=\"SHIP\",VLOOKUP($I$20,Delivery_Fee!$A$6:$U$35,VLOOKUP($D$23,country_code!$D$2:$I$249,6,0),0))","v":5550},"保管料",500,null,null,null,null,null,null,"My Prepared Box",null,{"$f":"IF(P14=\"My Prepared Box\",0,IF(P14=\"Medium Box\",500,1000))","v":0}]
["Bldgs Name",{"$f":"IF(P35=\"\",\"\",P35)","v":5}]
["Address",{"$f":"IF(P37=\"\",\"\",P37)","v":"Aiea 123"},null,null,null,"施設手数料",{"$f":"IF(AND(P18=\"紙申請\",P10=\"施設申請\"),2200,IF(P10=\"施設申請\",800,0))","v":0},"BOX",{"$f":"IF(P14=\"My Prepared Box\",0,IF(P14=\"Medium Box\",500,1000))","v":0}]
["City or Town",{"$f":"IF(P39=\"\",\"\",P39)","v":"HONOLULU"}]
["State",{"$f":"IF(P41=\"\",\"\",P41)","v":"HAWAII"},null,"Country Code",{"$f":"INDEX(country_code!$B$2:$B$249,MATCH(D23,country_code!$D$2:$D$249,0),1)","v":"CN"},"通関手数料",{"$f":"R18+M5","v":4400},null,null,null,null,null,null,null,null,"紙申請",null,{"$f":"IF(AND(P10=\"施設申請\",P18=\"mail申請\"),2500,IF(AND(P10=\"施設申請\",P18=\"紙申請\"),2200,IF(AND(P10=\"お客様申請\",P18=\"mail申請\"),3300,IF(AND(P10=\"お客様申請\",P18=\"紙申請\"),4400,4400))))","v":4400}]
["TEL",{"$f":"IF(P43=\"\",\"\",P43)","v":"090-2396-5290"}]
["FAX",{"$f":"IF(P45=\"\",\"\",P45)","v":10},null,null,null,"送達手段",{"$f":"A23","v":"AIR"},"総重量",{"$f":"ROUNDUP((SUM(F25:F84)+$M$4)/1000,0)","v":6}]
["email",{"$f":"IF(P47<>\"\",P47&\";\"&\"takara@ryupta.co.jp;taira@ryupta.co.jp\",\"takara@ryupta.co.jp;taira@ryupta.co.jp\")","v":"takara@ryupta.co.jp;taira@ryupta.co.jp"}]
["送達手段（Shipped Per)",null,null,"仕向地（To）",null,null,"差出地（From）"]
["AIR",null,null,"CHINA",null,null,"JAPAN"]
["内容品の記載\n（Description)",null,null,"数量\n（Qty)","重量/個\n（Weight)","重量小計\n(Sub/Wgt)","単価JPY\n（U/Price)","合計額\n（Amount Price)"]
["T-shirt",null,null,5,520,{"$f":"IF(D25=\"\",\"\",D25*E25)","v":2600},3000,{"$f":"IF(D25=\"\",\"\",D25*G25)","v":15000},null,null,"Addressee's Info(收件人)",null,"Example(输入例子）",null,null,"Your Information"]
[null,null,null,null,null,{"$f":"IF(D26=\"\",\"\",D26*E26)","v":""},null,{"$f":"IF(D26=\"\",\"\",D26*G26)","v":""}]
[null,null,null,null,null,{"$f":"IF(D27=\"\",\"\",D27*E27)","v":""},null,{"$f":"IF(D27=\"\",\"\",D27*G27)","v":""},null,null,"Company's Name",null,"Okinawa Products Trading Alliance Co., LTD.",null,null,1]
[null,null,null,null,null,"",null,""]
[null,null,null,null,null,"",null,"",null,null,"Department Name",null,"Business Department",null,null,2]
[null,null,null,null,null,"",null,""]
[null,null,null,null,null,"",null,"",null,null,"Name",null,"Yoko Gushiken",null,null,3]
[null,null,null,null,null,"",null,""]
[null,null,null,null,null,"",null,"",null,null,"Postal Code",null,96815,null,null,4]
[null,null,null,null,null,"",null,""]
[null,null,null,null,null,"",null,"",null,null,"Building Name",null,"Hinode APT",null,null,5]
[null,null,null,null,null,"",null,""]
[null,null,null,null,null,"",null,"",null,null,"Address",null,"1234*** Parkside Ave",null,null,"Aiea 123"]
[null,null,null,null,null,"",null,""]
[null,null,null,null,null,"",null,"",null,null,"City or Town",null,"Honolulu",null,null,"HONOLULU"]
[null,null,null,null,null,"",null,""]
{"$rows_left_out":48}
{"sheet":"紙申請","index":3,"n_rows":56,"n_cols":9,"rows_kept":56,"cut":false,"hidden":false,"merged":[[53,1,53,5],[54,1,54,5],[55,1,55,5],[49,1,49,5],[50,1,50,5],[51,1,51,5],[52,1,52,5],[46,1,46,5],[47,1,47,5],[48,1,48,5],[39,1,39,5],[40,1,40,5],[41,1,41,5],[42,1,42,5],[43,1,43,5],[34,1,34,5],[35,1,35,5],[36,1,36,5],[37,1,37,5],[38,1,38,5],[18,0,18,2],[19,0,19,2],[20,0,20,2],[4,0,4,2],[6,0,6,2],[8,0,8,2],[0,0,0,8],[44,1,44,5],[45,1,45,5],[29,0,29,8],[30,1,30,5],[31,1,31,5],[32,1,32,5],[33,1,33,5],[20,6,20,8],[21,6,21,8],[22,6,22,8],[23,6,23,8],[24,6,24,8],[16,0,16,2],[21,0,21,2],[22,0,22,2],[23,0,23,2],[24,0,24,2],[20,3,20,5],[21,3,21,5],[22,3,22,5],[23,3,23,5],[24,3,24,5],[16,3,16,5],[16,6,16,8],[17,3,17,5],[18,3,18,5],[19,3,19,5],[17,6,17,8],[18,6,18,8],[19,6,19,8],[17,0,17,2],[4,3,4,5],[4,6,4,8],[5,0,5,2],[5,3,5,5],[5,6,5,8],[2,0,2,2],[2,3,2,5],[2,6,2,8],[3,0,3,2],[3,3,3,5],[3,6,3,8],[8,3,8,5],[8,6,8,8],[13,0,13,2],[13,3,13,5],[13,6,13,8],[6,3,6,5],[6,6,6,8],[7,0,7,2],[7,3,7,5],[7,6,7,8],[1,0,1,2],[15,0,15,2],[28,0,28,8],[27,0,27,2],[27,3,27,5],[27,6,27,8],[25,0,25,2],[25,3,25,5],[25,6,25,8],[26,0,26,2],[26,3,26,5],[26,6,26,8],[9,0,9,2],[10,0,10,2],[11,0,11,2],[12,0,12,2],[9,3,9,5],[10,3,10,5],[11,3,11,5],[12,3,12,5],[9,6,9,8],[10,6,10,8],[11,6,11,8],[12,6,12,8]]}
["海外宅配・配送サービス申込書\n依頼者&配送先情報"]
["【受取人】"]
["Addressee's Info(收件人)",null,null,"Example(输入例子）",null,null,"Your Information"]
["Company's Name",null,null,"Okinawa Products Trading Alliance Co., LTD."]
["Department Name",null,null,"Business Department"]
["Name",null,null,"Yoko Gushiken"]
["Postal Code",null,null,96815]
["Building Name",null,null,"#203 Hinode APT"]
["Address",null,null,"1234*** Parkside Ave"]
["Village/City/Town",null,null,"Honolulu"]
["State",null,null,"Hawaii"]
["Customer's TEL",null,null,"992-****-***"]
["HOTEL FAX",null,null,"992-****-***"]
["Email",null,null,"taira@ryupta.co.jp"]
[]
["【差出人】"]
["Sender's Info(发件人)",null,null,"Example(输入例子）",null,null,"Your Information"]
["Hotel's Name",null,null,"Okinawa Perfect Hotel"]
["Room Number",null,null,301]
["HOTEL Postal Code",null,null,"901-0202"]
["HOTEL Shop's Name",null,null,"1F Souvenior Shop"]
["HOTEL Address",null,null,"Kakazu 603-8"]
["HOTEL City or Town",null,null,"Tomigusuku-City"]
["Prefecture or State",null,null,"Okinawa"]
["Cusmer's Name",null,null,"Chen Pao Yu"]
["CUSTOMER'S TEL",null,null,"090-****-***"]
["HOTEL FAX",null,null,"090-****-***"]
["Email",null,null,"takara@ryupta.co.jp"]
["     入力必須項目（Required）"]
["海外配送サービス申込書/商品リスト（Commodity List）FAX:098-856-8613"]
["No.","商品名",null,null,null,null,"重量(g)/個\nWeight","数量\nQuantity","単価/個\nPrice"]
[1]
[{"$f":"A32+1","v":2}]
[{"$f":"A33+1","v":3}]
[4]
[5]
[6]
[7]
[8]
[9]
{"$rows_left_out":17}
{"sheet":"個人受付","index":4,"n_rows":0,"n_cols":0,"rows_kept":0,"cut":false,"hidden":false,"merged":[]}

{"sheet":"店舗受付","index":5,"n_rows":0,"n_cols":0,"rows_kept":0,"cut":false,"hidden":false,"merged":[]}

{"sheet":"Send_Mail","index":6,"n_rows":0,"n_cols":0,"rows_kept":0,"cut":false,"hidden":false,"merged":[]}